Target
5-hydroxytryptamine receptor 6
Ligand
BDBM50090532
Substrate
Meas. Tech.
ChEBML_3623
Ki
3±n/a nM
Citation
 Isaac, MSlassi, AXin, TMacLean, NWilson, JMcCallum, KWang, HDemchyshyn, L 6-Bicyclopiperazinyl-1-arylsulfonylindoles and 6-bicyclopiperidinyl-1-arylsulfonylindoles derivatives as novel, potent, and selective 5-HT6 receptor antagonists. Bioorg Med Chem Lett 10:1719-21 (2000)  
Target
Name:
5-hydroxytryptamine receptor 6
Synonyms:
5-HT-6 5-hydroxytryptamine receptor 6 (5-HT-6) 5-hydroxytryptamine receptor 6 (5HT6) HTR6 Serotonin 6 (5-HT6) receptor | Serotonin Receptor 6
Type:
G Protein-Coupled Receptor (GPCR)
Mol. Mass.:
46968.43
Organism:
Homo sapiens (Human)
Description:
P50406
Residue:
440
  
Inhibitor
Name:
BDBM50090532
Synonyms:
2-[1-(Naphthalene-2-sulfonyl)-1H-indol-6-yl]-octahydro-pyrido[1,2-a]pyrazine | CHEMBL45977
Type:
Small organic molecule
Emp. Form.:
C26H27N3O2S
Mol. Mass.:
445.576
SMILES:
O=S(=O)(c1ccc2ccccc2c1)n1ccc2ccc(cc12)N1CCN2CCCCC2C1
: