Target
Coagulation factor X
Ligand
BDBM50090604
Substrate
Meas. Tech.
ChEBML_48997
Ki
160±n/a nM
Citation
 He, WHanney, BMyers, MRSpada, APBrown, KColussi, DChu, V Nonbenzamidine compounds as selective factor Xa inhibitors. Bioorg Med Chem Lett 10:1737-9 (2000)  
Target
Name:
Coagulation factor X
Synonyms:
Activated coagulation factor X (FXa) Coagulation factor X precursor F10 Factor X heavy chain Factor Xa Stuart-Prower factor
Type:
Enzyme
Mol. Mass.:
54726.60
Organism:
Homo sapiens (Human)
Description:
Residue:
488
  
Inhibitor
Name:
BDBM50090604
Synonyms:
2-[4-(6-Chloro-benzo[b]thiophene-2-sulfonyl)-2-oxo-piperazin-1-yl]-N-(2-thiazol-4-yl-ethyl)-acetamide | CHEMBL45995
Type:
Small organic molecule
Emp. Form.:
C19H19ClN4O4S3
Mol. Mass.:
499.027
SMILES:
Clc1ccc2cc(sc2c1)S(=O)(=O)N1CCN(CC(=O)NCCc2cscn2)C(=O)C1
: