Target
Coagulation factor X
Ligand
BDBM50090602
Substrate
Meas. Tech.
ChEBML_48997
Ki
>1200±n/a nM
Citation
 He, WHanney, BMyers, MRSpada, APBrown, KColussi, DChu, V Nonbenzamidine compounds as selective factor Xa inhibitors. Bioorg Med Chem Lett 10:1737-9 (2000)  
Target
Name:
Coagulation factor X
Synonyms:
Activated coagulation factor X (FXa) Coagulation factor X precursor F10 Factor X heavy chain Factor Xa Stuart-Prower factor
Type:
Enzyme
Mol. Mass.:
54726.60
Organism:
Homo sapiens (Human)
Description:
Residue:
488
  
Inhibitor
Name:
BDBM50090602
Synonyms:
(R)-2-{2-[4-(6-Chloro-benzo[b]thiophene-2-sulfonyl)-2-oxo-piperazin-1-yl]-acetylamino}-3-(3H-imidazol-4-yl)-propionic acid methyl ester | CHEMBL46147
Type:
Small organic molecule
Emp. Form.:
C21H22ClN5O6S2
Mol. Mass.:
540.012
SMILES:
COC(=O)[C@@H](Cc1cnc[nH]1)NC(=O)CN1CCN(CC1=O)S(=O)(=O)c1cc2ccc(Cl)cc2s1
: