Target
Sodium-dependent noradrenaline transporter
Ligand
BDBM50091095
Substrate
Meas. Tech.
ChEMBL_142937 (CHEMBL750366)
Ki
1992±n/a nM
Citation
 Wilson, AAGinovart, NSchmidt, MMeyer, JHThrelkeld, PGHoule, S Novel radiotracers for imaging the serotonin transporter by positron emission tomography: synthesis, radiosynthesis, and in vitro and ex vivo evaluation of (11)C-labeled 2-(phenylthio)araalkylamines. J Med Chem 43:3103-10 (2000)  
Target
Name:
Sodium-dependent noradrenaline transporter
Synonyms:
Monoamine transporter NET Noradrenaline Transporter (NET) Norepinephrine transporter protein (NET) SLC6A2 Sodium-dependent noradrenaline transporter (NET) | Solute carrier family 6 member 2
Type:
Multi-pass membrane protein
Mol. Mass.:
69337.72
Organism:
Homo sapiens (Human)
Description:
P23975
Residue:
617
  
Inhibitor
Name:
BDBM50091095
Synonyms:
2-(2-Dimethylaminomethyl-phenylsulfanyl)-5-methoxy-phenylamine | CHEMBL107077
Type:
Small organic molecule
Emp. Form.:
C16H20N2OS
Mol. Mass.:
288.408
SMILES:
COc1ccc(Sc2ccccc2CN(C)C)c(N)c1
: