Target
Glutamate receptor ionotropic, NMDA 1
Ligand
BDBM50091626
Substrate
Meas. Tech.
ChEMBL_140482 (CHEMBL747072)
IC50
19±n/a nM
Citation
 Wright, JLGregory, TFKesten, SRBoxer, PASerpa, KAMeltzer, LTWise, LDEspitia, SAKonkoy, CSWhittemore, ERWoodward, RM Subtype-selective N-methyl-D-aspartate receptor antagonists: synthesis and biological evaluation of 1-(heteroarylalkynyl)-4-benzylpiperidines. J Med Chem 43:3408-19 (2000)  
Target
Name:
Glutamate receptor ionotropic, NMDA 1
Synonyms:
GRIN1 Glutamate [NMDA] receptor subunit zeta-1 N-methyl-D-aspartate receptor subunit NR1 NMDZ1_HUMAN | phencyclidine
Type:
Enzyme Catalytic Domain
Mol. Mass.:
105397.81
Organism:
Homo sapiens (Human)
Description:
Q05586
Residue:
938
  
Inhibitor
Name:
BDBM50091626
Synonyms:
5-[3-(4-Benzyl-4-hydroxy-piperidin-1-yl)-prop-1-ynyl]-1,3-dihydro-benzoimidazol-2-one | CHEMBL326742
Type:
Small organic molecule
Emp. Form.:
C22H23N3O2
Mol. Mass.:
361.4369
SMILES:
OC1(Cc2ccccc2)CCN(CC#Cc2ccc3[nH]c(=O)[nH]c3c2)CC1
: