Target
Neuropeptide Y receptor type 2
Ligand
BDBM50091672
Substrate
Meas. Tech.
ChEMBL_154174 (CHEMBL762378)
IC50
0.05±n/a nM
Citation
 Balasubramaniam, ATao, ZZhai, WStein, MSheriff, SChance, WTFischer, JEEden, PETaylor, JELiu, CDMcFadden, DWVoisin, TRoze, CLaburthe, M Structure-activity studies including a Psi(CH(2)-NH) scan of peptide YY (PYY) active site, PYY(22-36), for interaction with rat intestinal PYY receptors: development of analogues with potent in vivo activity in the intestine. J Med Chem 43:3420-7 (2000)  
Target
Name:
Neuropeptide Y receptor type 2
Synonyms:
NPY-Y2 Neuropeptide Y receptor type 2 | Neuropeptide Y/peptide YY-Y2 receptor
Type:
Enzyme Catalytic Domain
Mol. Mass.:
42514.44
Organism:
RAT
Description:
NPY-Y2 NPY2R RAT::Q9ERC0
Residue:
381
  
Inhibitor
Name:
BDBM50091672
Synonyms:
CHEMBL412704 | N-alpha-Ac-[CH2-NH35-36]PYY(22-36)-NH2(N-alpha-Ac-ASLAHYLNLVTRQR-CH2-NH-Y-NH2)
Type:
Small organic molecule
Emp. Form.:
C86H141N29O21
Mol. Mass.:
1917.2214
SMILES:
CC(C)C[C@H](NC(=O)[C@H](CO)NC(=O)[C@H](C)NC(C)=O)C(=O)N[C@@H](CCCNC(N)=N)C(=O)N[C@@H](Cc1cnc[nH]1)C(=O)N[C@@H](Cc1ccc(O)cc1)C(=O)N[C@@H](CC(C)C)C(=O)N[C@@H](CC(N)=O)C(=O)N[C@@H](CC(C)C)C(=O)N[C@@H](C(C)C)C(=O)N[C@@H]([C@@H](C)O)C(=O)N[C@@H](CCCNC(N)=N)C(=O)N[C@@H](CCC(N)=O)C(=O)N[C@@H](CCCNC(N)=N)CN[C@@H](Cc1ccc(O)cc1)C(N)=O
: