Target
Protein kinase C delta type
Ligand
BDBM50535785
Substrate
Meas. Tech.
ChEMBL_1931637 (CHEMBL4477289)
Ki
3.4±n/a nM
Citation
 Staveness, DAbdelnabi, RNear, KENakagawa, YNeyts, JDelang, LLeyssen, PWender, PA Inhibition of Chikungunya Virus-Induced Cell Death by Salicylate-Derived Bryostatin Analogues Provides Additional Evidence for a PKC-Independent Pathway. J Nat Prod 79:680-4 (2016)  
Target
Name:
Protein kinase C delta type
Synonyms:
KPCD_HUMAN PKCD Protein Kinase C- delta nPKC-delta
Type:
Enzyme
Mol. Mass.:
77516.79
Organism:
Homo sapiens (Human)
Description:
The recombinant human PKC enzymes were produced using a baculovirus expression system in SF9 cells
Residue:
676
  
Inhibitor
Name:
BDBM50535785
Synonyms:
CHEMBL4526756
Type:
Small organic molecule
Emp. Form.:
C42H56O13
Mol. Mass.:
768.8862
SMILES:
CCCCCCCC(=O)O[C@H]1\C(C[C@H]2C[C@H](CO)OC(=O)CCOc3ccc(cc3C(=O)OCC(C)(C)[C@]1(O)O2)-c1ccccc1OC(C)C)=C\C(=O)OC
: