Target
Nitric oxide synthase, endothelial
Ligand
BDBM50091792
Substrate
Meas. Tech.
ChEBML_65293
IC50
49±n/a nM
Citation
 Hagmann, WKCaldwell, CGChen, PDurette, PLEsser, CKLanza, TJKopka, IEGuthikonda, RShah, SKMacCoss, MChabin, RMFletcher, DGrant, SKGreen, BGHumes, JLKelly, TMLuell, SMeurer, RMoore, VPacholok, SGPavia, TWilliams, HRWong, KK Substituted 2-aminopyridines as inhibitors of nitric oxide synthases. Bioorg Med Chem Lett 10:1975-8 (2001)  
Target
Name:
Nitric oxide synthase, endothelial
Synonyms:
Constitutive NOS Endothelial NOS NOS type III NOS3_HUMAN Nitric oxide synthase (inducible and endothelial) Nitric-oxide synthase (endothelial and brain) eNOS
Type:
Enzyme Catalytic Domain
Mol. Mass.:
133297.84
Organism:
Homo sapiens (Human)
Description:
P29474
Residue:
1203
  
Inhibitor
Name:
BDBM50091792
Synonyms:
6-Ethyl-4-methyl-pyridin-2-ylamine | CHEMBL294084
Type:
Small organic molecule
Emp. Form.:
C8H12N2
Mol. Mass.:
136.1943
SMILES:
CCc1cc(C)cc(N)n1
: