Target
Neuropeptide Y receptor type 4
Ligand
BDBM50535854
Substrate
Meas. Tech.
ChEMBL_1932393 (CHEMBL4478045)
EC50
6.4±n/a nM
Citation
 Kuhn, KKErtl, TDukorn, SKeller, MBernhardt, GReiser, OBuschauer, A High Affinity Agonists of the Neuropeptide Y (NPY) Y4 Receptor Derived from the C-Terminal Pentapeptide of Human Pancreatic Polypeptide (hPP): Synthesis, Stereochemical Discrimination, and Radiolabeling. J Med Chem 59:6045-58 (2016)  
Target
Name:
Neuropeptide Y receptor type 4
Synonyms:
NPY-Y4 NPY4R PP1 Pancreatic polypeptide receptor 1
Type:
Enzyme Catalytic Domain
Mol. Mass.:
42207.58
Organism:
Homo sapiens (Human)
Description:
NPY-Y4 PPYR1 HUMAN::P50391
Residue:
375
  
Inhibitor
Name:
BDBM50535854
Synonyms:
CHEMBL3787712
Type:
Small organic molecule
Emp. Form.:
C85H132N26O17
Mol. Mass.:
1790.1216
SMILES:
CC(C)C[C@H](NC(=O)[C@H](CCCNC(N)=N)NC(=O)[C@H](Cc1ccc(O)cc1)NC(=O)CCCCCCC(=O)N[C@@H](Cc1ccc(O)cc1)C(=O)N[C@@H](CCCN\C(N)=N\C(=O)NCCCCN)C(=O)N[C@@H](CC(C)C)C(=O)N[C@@H](CCCNC(N)=N)C(=O)N[C@@H](Cc1ccc(O)cc1)C(N)=O)C(=O)N[C@@H](CCCNC(N)=N)C(=O)N[C@@H](Cc1ccc(O)cc1)C(N)=O
: