Target
Neuropeptide Y receptor type 4
Ligand
BDBM50535849
Substrate
Meas. Tech.
ChEMBL_1932395 (CHEMBL4478047)
EC50
4.0±n/a nM
Citation
 Kuhn, KKErtl, TDukorn, SKeller, MBernhardt, GReiser, OBuschauer, A High Affinity Agonists of the Neuropeptide Y (NPY) Y4 Receptor Derived from the C-Terminal Pentapeptide of Human Pancreatic Polypeptide (hPP): Synthesis, Stereochemical Discrimination, and Radiolabeling. J Med Chem 59:6045-58 (2016)  
Target
Name:
Neuropeptide Y receptor type 4
Synonyms:
NPY-Y4 NPY4R PP1 Pancreatic polypeptide receptor 1
Type:
Enzyme Catalytic Domain
Mol. Mass.:
42207.58
Organism:
Homo sapiens (Human)
Description:
NPY-Y4 PPYR1 HUMAN::P50391
Residue:
375
  
Inhibitor
Name:
BDBM50535849
Synonyms:
CHEMBL4522438
Type:
Small organic molecule
Emp. Form.:
C83H128N26O17
Mol. Mass.:
1762.0684
SMILES:
CCC(=O)N[C@@H](CCCC[C@H](N)C(=O)N[C@@H](Cc1ccc(O)cc1)C(=O)N[C@@H](CCCNC(N)=N)C(=O)N[C@@H](CC(C)C)C(=O)N[C@@H](CCCNC(N)=N)C(=O)N[C@@H](Cc1ccc(O)cc1)C(N)=O)C(=O)N[C@@H](Cc1ccc(O)cc1)C(=O)N[C@@H](CCCNC(N)=N)C(=O)N[C@@H](CC(C)C)C(=O)N[C@@H](CCCNC(N)=N)C(=O)N[C@@H](Cc1ccc(O)cc1)C(N)=O
: