Target
Mitogen-activated protein kinase 11
Ligand
BDBM50091935
Substrate
Meas. Tech.
ChEBML_124662
IC50
52±n/a nM
Citation
 Dumas, JHatoum-Mokdad, HSibley, RRiedl, BScott, WJMonahan, MKLowinger, TBBrennan, CNatero, RTurner, TJohnson, JSSchoenleber, RBhargava, AWilhelm, SMHousley, TJRanges, GEShrikhande, A 1-Phenyl-5-pyrazolyl ureas: potent and selective p38 kinase inhibitors. Bioorg Med Chem Lett 10:2051-4 (2000)  
Target
Name:
Mitogen-activated protein kinase 11
Synonyms:
MAP kinase p38 MK11_HUMAN Mitogen-activated protein kinase p38 beta SAPK2 Stress-activated protein kinase 2 p38-2 p38b
Type:
Enzyme Catalytic Domain
Mol. Mass.:
41351.73
Organism:
Homo sapiens (Human)
Description:
gi_20128774
Residue:
364
  
Inhibitor
Name:
BDBM50091935
Synonyms:
1-[2-(3-Amino-phenyl)-5-tert-butyl-2H-pyrazol-3-yl]-3-(2,3-dichloro-phenyl)-urea | CHEMBL64040
Type:
Small organic molecule
Emp. Form.:
C20H21Cl2N5O
Mol. Mass.:
418.32
SMILES:
CC(C)(C)c1cc(NC(=O)Nc2cccc(Cl)c2Cl)n(n1)-c1cccc(N)c1
: