Target
DNA polymerase catalytic subunit
Ligand
BDBM50092008
Substrate
Meas. Tech.
ChEBML_157582
IC50
52000±n/a nM
Citation
 Vaillancourt, VACudahy, MMStaley, SABrideau, RJConrad, SJKnechtel, MLOien, NLWieber, JLYagi, YWathen, MW Naphthalene carboxamides as inhibitors of human cytomegalovirus DNA polymerase. Bioorg Med Chem Lett 10:2079-81 (2000)  
Target
Name:
DNA polymerase catalytic subunit
Synonyms:
DPOL_HHV6U U38 | XILF0
Type:
PROTEIN
Mol. Mass.:
115827.55
Organism:
Human herpesvirus 6A (strain Uganda-1102) (HHV-6 variant A) (Human Blymphotropic virus)
Description:
ChEMBL_157582
Residue:
1012
  
Inhibitor
Name:
BDBM50092008
Synonyms:
3-Hydroxy-naphthalene-2-carboxylic acid 4-chloro-benzylamide | CHEMBL293187
Type:
Small organic molecule
Emp. Form.:
C18H14ClNO2
Mol. Mass.:
311.762
SMILES:
Oc1cc2ccccc2cc1C(=O)NCc1ccc(Cl)cc1
: