Target
Hepatocyte growth factor receptor
Ligand
BDBM50536472
Substrate
Meas. Tech.
ChEMBL_1933774 (CHEMBL4479426)
EC50
1.9±n/a nM
Citation
 Zhao, FZhang, JZhang, LHao, YShi, CXia, GYu, JLiu, Y Discovery and optimization of a series of imidazo[4,5-b]pyrazine derivatives as highly potent and exquisitely selective inhibitors of the mesenchymal-epithelial transition factor (c-Met) protein kinase. Bioorg Med Chem 24:4281-4290 (2016)  
Target
Name:
Hepatocyte growth factor receptor
Synonyms:
Hepatocyte growth factor receptor Hepatocyte growth factor receptor (c-MET) MET Met proto-oncogene (hepatocyte growth factor receptor) Tyrosine-protein kinase Met (c-Met) c-Met kinase
Type:
Protein
Mol. Mass.:
155559.73
Organism:
Homo sapiens (Human)
Description:
P08581
Residue:
1390
  
Inhibitor
Name:
BDBM50536472
Synonyms:
CHEMBL4581168
Type:
Small organic molecule
Emp. Form.:
C20H16FN7
Mol. Mass.:
373.3863
SMILES:
C[C@H](c1cc2cccnc2cc1F)n1cnc2ncc(nc12)-c1cnn(C)c1
: