Target
Angiopoietin-1 receptor
Ligand
BDBM25116
Substrate
Meas. Tech.
ChEBML_225776
IC50
7000±n/a nM
Citation
 Arnold, LDCalderwood, DJDixon, RWJohnston, DNKamens, JSMunschauer, RRafferty, PRatnofsky, SE Pyrrolo[2,3-d]pyrimidines containing an extended 5-substituent as potent and selective inhibitors of lck I. Bioorg Med Chem Lett 10:2167-70 (2001)  
Target
Name:
Angiopoietin-1 receptor
Synonyms:
TEK TIE2_HUMAN Tyrosine-protein kinase receptor (TIE-2) Tyrosine-protein kinase receptor TEK (p140 TEK) Tyrosine-protein kinase receptor TIE2/TEK VMCM1 p140 TEK
Type:
Enzyme
Mol. Mass.:
125835.70
Organism:
Homo sapiens (Human)
Description:
Q02763
Residue:
1124
  
Inhibitor
Name:
BDBM25116
Synonyms:
1-tert-butyl-3-(4-methylphenyl)-1H-pyrazolo[3,4-d]pyrimidin-4-amine PP1 US10807986, Comparative compound 1 US11701353, PP1 (Pfizer) | cid_1400
Type:
Small organic molecule
Emp. Form.:
C16H19N5
Mol. Mass.:
281.3556
SMILES:
Cc1ccc(cc1)-c1nn(c2ncnc(N)c12)C(C)(C)C
: