Target
Tyrosine-protein kinase Lck
Ligand
BDBM50092241
Substrate
Meas. Tech.
ChEMBL_221332 (CHEMBL842024)
IC50
<1±n/a nM
Citation
 Burchat, AFCalderwood, DJHirst, GCHolman, NJJohnston, DNMunschauer, RRafferty, PTometzki, GB Pyrrolo[2,3-d]pyrimidines containing an extended 5-substituent as potent and selective inhibitors of lck II. Bioorg Med Chem Lett 10:2171-4 (2001)  
Target
Name:
Tyrosine-protein kinase Lck
Synonyms:
2.7.10.2 LCK_HUMAN Leukocyte C-terminal Src kinase Lymphocyte-specific protein tyrosine kinase Protein YT16 Proto-oncogene tyrosine-protein kinase LCK T cell-specific protein-tyrosine kinase
Type:
Mol. Mass.:
57987.83
Organism:
Homo sapiens (Human)
Description:
P06239
Residue:
509
  
Inhibitor
Name:
BDBM50092241
Synonyms:
7-tert-Butyl-5-[4-(4-methoxy-phenoxy)-phenyl]-7H-pyrrolo[2,3-d]pyrimidin-4-ylamine | CHEMBL69649
Type:
Small organic molecule
Emp. Form.:
C23H24N4O2
Mol. Mass.:
388.4623
SMILES:
COc1ccc(Oc2ccc(cc2)-c2cn(c3ncnc(N)c23)C(C)(C)C)cc1
: