Target
Cannabinoid receptor 2
Ligand
BDBM50061108
Substrate
Meas. Tech.
ChEMBL_46990 (CHEMBL658959)
Ki
0.20±n/a nM
Citation
 Mahadevan, ASiegel, CMartin, BRAbood, MEBeletskaya, IRazdan, RK Novel cannabinol probes for CB1 and CB2 cannabinoid receptors. J Med Chem 43:3778-85 (2000)  
Target
Name:
Cannabinoid receptor 2
Synonyms:
CANNABINOID CB2 CB2 CB2B CNR2_HUMAN Cannabinoid CB2 receptor Cannabinoid receptor 2 (CB2R) | hCB2
Type:
G Protein-Coupled Receptor (GPCR)
Mol. Mass.:
39690.94
Organism:
Homo sapiens (Human)
Description:
P34972
Residue:
360
  
Inhibitor
Name:
BDBM50061108
Synonyms:
3-(1,1-Dimethyl-heptyl)-9-hydroxymethyl-6,6-dimethyl-6H-benzo[c]chromen-1-ol | CHEMBL111724
Type:
Small organic molecule
Emp. Form.:
C25H34O3
Mol. Mass.:
382.5357
SMILES:
CCCCCCC(C)(C)c1cc(O)c-2c(OC(C)(C)c3ccc(CO)cc-23)c1
: