Target
Cannabinoid receptor 2
Ligand
BDBM50092592
Substrate
Meas. Tech.
ChEMBL_46990 (CHEMBL658959)
Ki
>10000±n/a nM
Citation
 Mahadevan, ASiegel, CMartin, BRAbood, MEBeletskaya, IRazdan, RK Novel cannabinol probes for CB1 and CB2 cannabinoid receptors. J Med Chem 43:3778-85 (2000)  
Target
Name:
Cannabinoid receptor 2
Synonyms:
CANNABINOID CB2 CB2 CB2B CNR2_HUMAN Cannabinoid CB2 receptor Cannabinoid receptor 2 (CB2R) | hCB2
Type:
G Protein-Coupled Receptor (GPCR)
Mol. Mass.:
39690.94
Organism:
Homo sapiens (Human)
Description:
P34972
Residue:
360
  
Inhibitor
Name:
BDBM50092592
Synonyms:
3-(1,1-Dimethyl-heptyl)-1-methoxy-6,6-dimethyl-6H-benzo[c]chromene-9-carboxylic acid isopropyl ester | CHEMBL340404
Type:
Small organic molecule
Emp. Form.:
C29H40O4
Mol. Mass.:
452.6255
SMILES:
CCCCCCC(C)(C)c1cc(OC)c-2c(OC(C)(C)c3ccc(cc-23)C(=O)OC(C)C)c1
: