Target
Lactoylglutathione lyase
Ligand
BDBM50092827
Substrate
Meas. Tech.
ChEMBL_71287 (CHEMBL684991)
Ki
16±n/a nM
Citation
 Kalsi, AKavarana, MJLu, TWhalen, DLHamilton, DSCreighton, DJ Role of hydrophobic interactions in binding S-(N-aryl/alkyl-N-hydroxycarbamoyl)glutathiones to the active site of the antitumor target enzyme glyoxalase I. J Med Chem 43:3981-6 (2000)  
Target
Name:
Lactoylglutathione lyase
Synonyms:
Aldoketomutase Glx I Glyoxalase I LGUL_HUMAN S-D-lactoylglutathione methylglyoxal lyase
Type:
Enzyme
Mol. Mass.:
20772.95
Organism:
Homo sapiens (Human)
Description:
Q04760
Residue:
184
  
Inhibitor
Name:
BDBM50092827
Synonyms:
CHEMBL127840 | S-(N-hexyl-N-hydroxycarbamoyl)glutathione
Type:
Small organic molecule
Emp. Form.:
C17H30N4O8S
Mol. Mass.:
450.507
SMILES:
CCCCCCN(O)C(=O)SC[C@H](NC(=O)CC[C@H](N)C(O)=O)C(=O)NCC(O)=O
: