Target
Histamine H3 receptor
Ligand
BDBM50074629
Substrate
Meas. Tech.
ChEBML_86906
Ki
0.120000±n/a nM
Citation
 Stark, HLigneau, XSadek, BGanellin, CRArrang, JMSchwartz, JCSchunack, W Analogues and derivatives of ciproxifan, a novel prototype for generating potent histamine H3-receptor antagonists. Bioorg Med Chem Lett 10:2379-82 (2001)  
Target
Name:
Histamine H3 receptor
Synonyms:
HH3R Hrh3
Type:
G Protein-Coupled Receptor (GPCR)
Mol. Mass.:
48607.98
Organism:
Rattus norvegicus (rat)
Description:
Residue:
445
  
Inhibitor
Name:
BDBM50074629
Synonyms:
4-[(1R,2R)-2-(5,5-Dimethyl-hex-1-ynyl)-cyclopropyl]-1H-imidazole Cipralisant
Type:
Small organic molecule
Emp. Form.:
C14H20N2
Mol. Mass.:
216.322
SMILES:
CC(C)(C)CCC#C[C@@H]1C[C@H]1c1cnc[nH]1
: