Target
Melatonin receptor type 1B
Ligand
BDBM50093266
Substrate
Meas. Tech.
ChEMBL_105244 (CHEMBL712574)
Ki
0.110±n/a nM
Citation
 Jellimann, CMathé-Allainmat, MAndrieux, JKloubert, SBoutin, JANicolas, JPBennejean, CDelagrange, PLanglois, M Synthesis of phenalene and acenaphthene derivatives as new conformationally restricted ligands for melatonin receptors. J Med Chem 43:4051-62 (2000)  
Target
Name:
Melatonin receptor type 1B
Synonyms:
MTNR1B Mel-1B-R Melatonin 1B Melatonin receptor type 1B | Melatonin receptor type 2 (MT2)
Type:
Enzyme
Mol. Mass.:
40203.54
Organism:
Homo sapiens (Human)
Description:
P49286
Residue:
362
  
Inhibitor
Name:
BDBM50093266
Synonyms:
CHEMBL131424 | N-(4-Methoxy-2,3-dihydro-1H-phenalen-1-ylmethyl)-butyramide
Type:
Small organic molecule
Emp. Form.:
C19H23NO2
Mol. Mass.:
297.3914
SMILES:
CCCC(=O)NCC1CCc2c(OC)ccc3cccc1c23
: