Target
Methylated-DNA--protein-cysteine methyltransferase
Ligand
BDBM5471
Substrate
Meas. Tech.
ChEMBL_28279 (CHEMBL645820)
IC50
>1000000±n/a nM
Citation
 Griffin, RJArris, CEBleasdale, CBoyle, FTCalvert, AHCurtin, NJDalby, CKanugula, SLembicz, NKNewell, DRPegg, AEGolding, BT Resistance-modifying agents. 8. Inhibition of O(6)-alkylguanine-DNA alkyltransferase by O(6)-alkenyl-, O(6)-cycloalkenyl-, and O(6)-(2-oxoalkyl)guanines and potentiation of temozolomide cytotoxicity in vitro by O(6)-(1-cyclopentenylmethyl)guanine. J Med Chem 43:4071-83 (2000)  
Target
Name:
Methylated-DNA--protein-cysteine methyltransferase
Synonyms:
6-O-methylguanine-DNA methyltransferase MGMT_HUMAN
Type:
PROTEIN
Mol. Mass.:
21651.27
Organism:
Homo sapiens (Human)
Description:
ChEMBL_144711
Residue:
207
  
Inhibitor
Name:
BDBM5471
Synonyms:
6-ethoxy-9H-purin-2-amine O6-Substituted Guanine Deriv. 2
Type:
Small organic molecule
Emp. Form.:
C7H9N5O
Mol. Mass.:
179.1793
SMILES:
CCOc1nc(N)nc2nc[nH]c12
: