Target
Adenylate cyclase type 8
Ligand
BDBM50010261
Substrate
Meas. Tech.
ChEMBL_1970863 (CHEMBL4603681)
EC50
94±n/a nM
Citation
 Weng, ZXu, GChen, DYang, YSong, GShen, WZhang, SWang, LYang, WZuo, Z Discovery of a potent and selective adenylyl cyclase type 8 agonist by docking-based virtual screening. Bioorg Med Chem Lett 30:0 (2020)  
Target
Name:
Adenylate cyclase type 8
Synonyms:
4.6.1.1 ADCY8 ATP pyrophosphate-lyase 8 Adenylate cyclase type VIII Ca(2+)/calmodulin-activated adenylyl cyclase
Type:
PROTEIN
Mol. Mass.:
140131.08
Organism:
Homo sapiens (Human)
Description:
ChEMBL_104878
Residue:
1251
  
Inhibitor
Name:
BDBM50010261
Synonyms:
(3R,4aR,5S,6S,6aS,10S,10aR,10bS)-3-ethenyl-6,10,10b-trihydroxy-3,4a,7,7,10a-pentamethyl-1-oxododecahydro-1H-benzo[f]chromen-5-yl acetate CHEMBL52606 cid_47936 colforsine | colforsinum
Type:
Small organic molecule
Emp. Form.:
C22H34O7
Mol. Mass.:
410.5012
SMILES:
CC(=O)O[C@H]1[C@@H](O)[C@H]2C(C)(C)CC[C@H](O)[C@]2(C)[C@@]2(O)C(=O)C[C@@](C)(O[C@]12C)C=C
: