Target
Bone morphogenetic protein 1
Ligand
BDBM50093851
Substrate
Meas. Tech.
ChEBML_158893
IC50
220±n/a nM
Citation
 Dankwardt, SMBilledeau, RJLawley, LKAbbot, SCMartin, RLChan, CSVan Wart, HEWalker, KA Solid-phase synthesis of di- and tripeptidic hydroxamic acids as inhibitors of procollagen C-proteinase. Bioorg Med Chem Lett 10:2513-6 (2001)  
Target
Name:
Bone morphogenetic protein 1
Synonyms:
BMP-1 BMP1_HUMAN PCOLC Procollagen C-proteinase | mTld
Type:
PROTEIN
Mol. Mass.:
111254.03
Organism:
Homo sapiens (Human)
Description:
ChEMBL_518962
Residue:
986
  
Inhibitor
Name:
BDBM50093851
Synonyms:
CHEMBL309647 | [(1R,2R)-1-((R)-1-Hydroxycarbamoyl-2-pyridin-2-yl-ethylcarbamoyl)-2-methyl-butyl]-carbamic acid benzyl ester
Type:
Small organic molecule
Emp. Form.:
C22H28N4O5
Mol. Mass.:
428.4815
SMILES:
CC[C@@H](C)[C@@H](NC(=O)OCc1ccccc1)C(=O)N[C@H](Cc1ccccn1)C(=O)NO
: