Target
Bone morphogenetic protein 1
Ligand
BDBM50093867
Substrate
Meas. Tech.
ChEBML_158893
IC50
78±n/a nM
Citation
 Dankwardt, SMBilledeau, RJLawley, LKAbbot, SCMartin, RLChan, CSVan Wart, HEWalker, KA Solid-phase synthesis of di- and tripeptidic hydroxamic acids as inhibitors of procollagen C-proteinase. Bioorg Med Chem Lett 10:2513-6 (2001)  
Target
Name:
Bone morphogenetic protein 1
Synonyms:
BMP-1 BMP1_HUMAN PCOLC Procollagen C-proteinase | mTld
Type:
PROTEIN
Mol. Mass.:
111254.03
Organism:
Homo sapiens (Human)
Description:
ChEMBL_518962
Residue:
986
  
Inhibitor
Name:
BDBM50093867
Synonyms:
CHEMBL314165 | {2-(4-Fluoro-phenyl)-1-[(1S,2R)-1-((S)-1-hydroxycarbamoyl-2-thiazol-4-yl-ethylcarbamoyl)-2-methyl-butylcarbamoyl]-ethyl}-carbamic acid benzyl ester
Type:
Small organic molecule
Emp. Form.:
C29H34FN5O6S
Mol. Mass.:
599.674
SMILES:
CC[C@@H](C)[C@H](NC(=O)C(Cc1ccc(F)cc1)NC(=O)OCc1ccccc1)C(=O)N[C@@H](Cc1cscn1)C(=O)NO
: