Target
Voltage-dependent L-type calcium channel subunit alpha-1C
Ligand
BDBM50538344
Substrate
Meas. Tech.
ChEMBL_1972604 (CHEMBL4605422)
EC50
>33000±n/a nM
Citation
 Kokkonda, SDeng, XWhite, KLEl Mazouni, FWhite, JShackleford, DMKatneni, KChiu, FCKBarker, HMcLaren, JCrighton, EChen, GAngulo-Barturen, IJimenez-Diaz, MBFerrer, SHuertas-Valentin, LMartinez-Martinez, MSLafuente-Monasterio, MJChittimalla, RShahi, SPWittlin, SWaterson, DBurrows, JNMatthews, DTomchick, DRathod, PKPalmer, MJCharman, SAPhillips, MA Lead Optimization of a Pyrrole-Based Dihydroorotate Dehydrogenase Inhibitor Series for the Treatment of Malaria. J Med Chem 63:4929-4956 (2020)  
Target
Name:
Voltage-dependent L-type calcium channel subunit alpha-1C
Synonyms:
CAC1C_HUMAN CACN2 CACNL1A1 Calcium channel (Type L) L-type calcium channel alpha-1c/beta-2/alpha2delta-1 Voltage-gated L-type calcium channel Voltage-gated calcium channel | Voltage-gated calcium channel subunit alpha Cav1.2
Type:
Enzyme Catalytic Domain
Mol. Mass.:
248979.79
Organism:
Homo sapiens (Human)
Description:
Calcium channel (Type L) 0 HUMAN::Q13936
Residue:
2221
  
Inhibitor
Name:
BDBM50538344
Synonyms:
CHEMBL4633246
Type:
Small organic molecule
Emp. Form.:
C16H16F3N3O
Mol. Mass.:
323.3129
SMILES:
Cc1c(Cc2ccc(nc2)C(F)(F)F)c[nH]c1C(=O)NC1CC1
: