Target
5-hydroxytryptamine receptor 2A
Ligand
BDBM50094676
Substrate
Meas. Tech.
ChEMBL_2563 (CHEMBL617110)
EC50
5370±n/a nM
Citation
 Blair, JBKurrasch-Orbaugh, DMarona-Lewicka, DCumbay, MGWatts, VJBarker, ELNichols, DE Effect of ring fluorination on the pharmacology of hallucinogenic tryptamines. J Med Chem 43:4701-10 (2001)  
Target
Name:
5-hydroxytryptamine receptor 2A
Synonyms:
5-HT-2A 5-HT2A 5-hydroxytryptamine receptor 2A (5HT2A) Htr2 Serotonin Receptor 2A
Type:
G Protein-Coupled Receptor (GPCR)
Mol. Mass.:
52852.05
Organism:
Rattus norvegicus (rat)
Description:
Rat cortex membranes 5-HT2A receptors.
Residue:
471
  
Inhibitor
Name:
BDBM50094676
Synonyms:
CHEMBL142936 N,N-diethyl-2-(1H-indol-3-yl)ethanamine
Type:
Small organic molecule
Emp. Form.:
C14H20N2
Mol. Mass.:
216.322
SMILES:
CCN(CC)CCc1c[nH]c2ccccc12
: