Target
Cytochrome P450 2C19
Ligand
BDBM50538668
Substrate
Meas. Tech.
ChEMBL_1973674 (CHEMBL4606492)
EC50
5780±n/a nM
Citation
 Janetka, JWHopper, ATYang, ZBarks, JDhason, MSWang, QSibley, LD Optimizing Pyrazolopyrimidine Inhibitors of Calcium Dependent Protein Kinase 1 for Treatment of Acute and Chronic Toxoplasmosis. J Med Chem 63:6144-6163 (2020)  
Target
Name:
Cytochrome P450 2C19
Synonyms:
CP2CJ_HUMAN CYPIIC17 Cytochrome P450 2C19 (CYP2C19) Mephenytoin 4-hydroxylase P450-254C
Type:
Enzyme
Mol. Mass.:
55935.47
Organism:
Homo sapiens (Human)
Description:
P33261
Residue:
490
  
Inhibitor
Name:
BDBM50538668
Synonyms:
CHEMBL4634455 | US11518761, Example 159
Type:
Small organic molecule
Emp. Form.:
C14H11F3N6O
Mol. Mass.:
336.2719
SMILES:
Nc1ncnc2n(nc(Oc3cc(ccn3)C(F)(F)F)c12)C1CC1
: