Target
Histamine H4 receptor
Ligand
BDBM50121205
Substrate
Meas. Tech.
ChEMBL_1973737 (CHEMBL4606555)
Ki
63±n/a nM
Citation
 Bartole, EGrätz, LLittmann, TWifling, DSeibel, UBuschauer, ABernhardt, G UR-DEBa242: A Py-5-Labeled Fluorescent Multipurpose Probe for Investigations on the Histamine H J Med Chem 63:5297-5311 (2020)  
Target
Name:
Histamine H4 receptor
Synonyms:
AXOR35 GPCR105 HH4R HRH4 Histamine H4 receptor Histamine receptor (H3 and H4) SP9144
Type:
G Protein-Coupled Receptor (GPCR)
Mol. Mass.:
44517.02
Organism:
Homo sapiens (Human)
Description:
Binding assays were using CHO cells stably expressing hH4R receptors.
Residue:
390
  
Inhibitor
Name:
BDBM50121205
Synonyms:
CHEBI:18295 | Histamine
Type:
Small organic molecule
Emp. Form.:
C5H9N3
Mol. Mass.:
111.1451
SMILES:
NCCc1c[nH]cn1
: