Target
Metabotropic glutamate receptor 2
Ligand
BDBM50279772
Substrate
Meas. Tech.
ChEMBL_106215 (CHEMBL713203)
Ki
3.72±n/a nM
Citation
 Nakazato, AKumagai, TSakagami, KYoshikawa, RSuzuki, YChaki, SIto, HTaguchi, TNakanishi, SOkuyama, S Synthesis, SARs, and pharmacological characterization of 2-amino-3 or 6-fluorobicyclo[3.1.0]hexane-2,6-dicarboxylic acid derivatives as potent, selective, and orally active group II metabotropic glutamate receptor agonists. J Med Chem 43:4893-909 (2000)  
Target
Name:
Metabotropic glutamate receptor 2
Synonyms:
GPRC1B GRM2_HUMAN Metabotropic glutamate receptor mGlu2 | metabotropic glutamate 2
Type:
Enzyme
Mol. Mass.:
95584.88
Organism:
Homo sapiens (Human)
Description:
Q14416
Residue:
872
  
Inhibitor
Name:
BDBM50279772
Synonyms:
2-[1-Amino-1-carboxy-2-(9H-xanthen-9-yl)-ethyl]-cyclopropanecarboxylic acid | CHEMBL144151
Type:
Small organic molecule
Emp. Form.:
C20H19NO5
Mol. Mass.:
353.3686
SMILES:
N[C@](CC1c2ccccc2Oc2ccccc12)([C@H]1C[C@@H]1C(O)=O)C(O)=O
: