Target
5-hydroxytryptamine receptor 2A
Ligand
BDBM50095051
Substrate
Meas. Tech.
ChEBML_2311
Ki
28±n/a nM
Citation
 Crawforth, JGoodacre, SMaxey, RBourrain, SPatel, SMarwood, RO'Connor, DHerbert, RHutson, PRowley, M 3-(4-Piperidinyl)- and 3-(8-aza-bicyclo[3.2.1]oct-3-yl)-2-phenyl-1H-indoles as bioavailable h5-HT2A antagonists. Bioorg Med Chem Lett 10:2701-3 (2000)  
Target
Name:
5-hydroxytryptamine receptor 2A
Synonyms:
5-HT-2 5-HT2A 5-hydroxytryptamine receptor 2A (5HT-2A) 5HT2A_HUMAN HTR2A | Serotonin receptor 2A
Type:
undefined
Mol. Mass.:
52607.65
Organism:
Homo sapiens (Human)
Description:
P28223
Residue:
471
  
Inhibitor
Name:
BDBM50095051
Synonyms:
3-(1-Benzyl-piperidin-4-yl)-2-phenyl-1H-indole | CHEMBL327169
Type:
Small organic molecule
Emp. Form.:
C26H26N2
Mol. Mass.:
366.498
SMILES:
C(N1CCC(CC1)c1c([nH]c2ccccc12)-c1ccccc1)c1ccccc1
: