Target
Adenosine kinase
Ligand
BDBM50095360
Substrate
Meas. Tech.
ChEMBL_31129 (CHEMBL643557)
IC50
550±n/a nM
Citation
 Cowart, MLee, CHGfesser, GABayburt, EKBhagwat, SSStewart, AOYu, HKohlhaas, KLMcGaraughty, SWismer, CTMikusa, JZhu, CAlexander, KMJarvis, MFKowaluk, EA Structure-activity studies of 5-substituted pyridopyrimidines as adenosine kinase inhibitors. Bioorg Med Chem Lett 11:83-6 (2001)  
Target
Name:
Adenosine kinase
Synonyms:
ADENOSINE Adenosine 5-phosphotransferase Adenosine kinase | Adk
Type:
Enzyme
Mol. Mass.:
40130.14
Organism:
Rattus norvegicus (rat)
Description:
Rat brain cytosol as enzyme source.
Residue:
361
  
Inhibitor
Name:
BDBM50095360
Synonyms:
7-(6-Morpholin-4-yl-pyridin-3-yl)-5-thiophen-3-yl-pyrido[2,3-d]pyrimidin-4-ylamine | CHEMBL354881
Type:
Small organic molecule
Emp. Form.:
C20H18N6OS
Mol. Mass.:
390.462
SMILES:
Nc1ncnc2nc(cc(-c3ccsc3)c12)-c1ccc(nc1)N1CCOCC1
: