Target
Muscarinic acetylcholine receptor M3
Ligand
BDBM50095654
Substrate
Meas. Tech.
ChEMBL_138696 (CHEMBL747663)
Ki
6.2±n/a nM
Citation
 Mitsuya, MKobayashi, KKawakami, KSatoh, AOgino, YKakikawa, TOhtake, NKimura, THirose, HSato, ANumazawa, THasegawa, TNoguchi, KMase, T A potent, long-acting, orally active (2R)-2-[(1R)-3, 3-difluorocyclopentyl]-2-hydroxy-2-phenylacetamide: novel muscarinic M(3) receptor antagonist with high selectivity for M(3) over M(2) receptors. J Med Chem 43:5017-29 (2001)  
Target
Name:
Muscarinic acetylcholine receptor M3
Synonyms:
ACM3_HUMAN Cholinergic, muscarinic M3 Muscarinic receptor M3 | RecName: Full=Muscarinic acetylcholine receptor M3
Type:
Enzyme
Mol. Mass.:
66151.03
Organism:
Homo sapiens (Human)
Description:
P20309
Residue:
590
  
Inhibitor
Name:
BDBM50095654
Synonyms:
2-(3,3-Difluoro-cyclopentyl)-2-hydroxy-N-[1-(4-methyl-pent-3-enyl)-piperidin-4-yl]-2-phenyl-acetamide | CHEMBL150219
Type:
Small organic molecule
Emp. Form.:
C24H34F2N2O2
Mol. Mass.:
420.5358
SMILES:
[#6]\[#6](-[#6])=[#6]\[#6]-[#6]-[#7]-1-[#6]-[#6]-[#6](-[#6]-[#6]-1)-[#7]-[#6](=O)[C@@]([#8])([#6@@H]-1-[#6]-[#6]C(F)(F)[#6]-1)c1ccccc1
: