Target
Calcitonin gene-related peptide type 1 receptor/Receptor activity-modifying protein 1
Ligand
BDBM391716
Substrate
Meas. Tech.
ChEMBL_1979839 (CHEMBL4612974)
Ki
0.019953±n/a nM
Citation
 Bucknell, SJAtor, MABrown, AJHBrown, JCansfield, ADCansfield, JEChristopher, JACongreve, MCseke, GDeflorian, FJones, CRMason, JSO'Brien, MAOtt, GRPickworth, MSouthall, SM Structure-Based Drug Discovery of  J Med Chem 63:7906-7920 (2020)  
Target
Name:
Calcitonin gene-related peptide type 1 receptor/Receptor activity-modifying protein 1
Synonyms:
Calcitonin-gene-related peptide receptor, CALCRL/RAMP1
Type:
Mol. Mass.:
Description:
ASSAY_ID of EBI is 327200
Components:
This complex has 2 components.
Component 1
Name:
Calcitonin gene-related peptide type 1 receptor
Synonyms:
Adrenomedullin receptor AM1; CALCRL/RAMP2 CALRL_HUMAN CGRP type 1 receptor mRNA Calcitonin gene-related peptide (CGRP) receptor Calcitonin receptor-like receptor Human CL receptor
Type:
Enzyme Catalytic Domain
Mol. Mass.:
52980.45
Organism:
Homo sapiens (Human)
Description:
Q16602
Residue:
461
  
Component 2
Name:
Receptor activity-modifying protein 1
Synonyms:
Calcitonin-gene-related peptide receptor, CALCRL/RAMP1 RAMP1_HUMAN
Type:
PROTEIN
Mol. Mass.:
16992.80
Organism:
Homo sapiens (Human)
Description:
EBI_100673
Residue:
148
  
Inhibitor
Name:
BDBM391716
Synonyms:
N-[(2R)-3-(7-methyl-1H- US10888561, Example 1
Type:
Small organic molecule
Emp. Form.:
C40H50N12O4
Mol. Mass.:
762.903
SMILES:
Cc1cc(C[C@@H](NC(=O)N2CCC(CC2)n2c3cccnc3[nH]c2=O)C(=O)N[C@@H](CC2CCNCC2)C(=O)N2CCN(CC2)c2ccncc2)cc2cn[nH]c12
: