Target
AMP deaminase 3
Ligand
BDBM50096171
Substrate
Meas. Tech.
ChEMBL_31886 (CHEMBL645676)
Ki
90±n/a nM
Citation
 Kasibhatla, SRBookser, BCXiao, WErion, MD AMP deaminase inhibitors. 5. Design, synthesis, and SAR of a highly potent inhibitor series. J Med Chem 44:613-8 (2001)  
Target
Name:
AMP deaminase 3
Synonyms:
AMP deaminase 3 AMPD3 | AMPD3_HUMAN
Type:
Protein
Mol. Mass.:
88818.80
Organism:
Homo sapiens (Human)
Description:
Residue:
767
  
Inhibitor
Name:
BDBM50096171
Synonyms:
4-[2-(8-Hydroxy-7,8-dihydro-6H-imidazo[4,5-d][1,3]diazepin-3-yl)-ethyl]-1-isopropoxy-5,6,7,8-tetrahydro-naphthalene-2-carboxylic acid | CHEMBL158023
Type:
Small organic molecule
Emp. Form.:
C22H28N4O4
Mol. Mass.:
412.4821
SMILES:
CC(C)Oc1c2CCCCc2c(CCn2cnc3C(O)CNC=Nc23)cc1C(O)=O
: