Target
AMP deaminase 3
Ligand
BDBM50096178
Substrate
Meas. Tech.
ChEMBL_31886 (CHEMBL645676)
Ki
1300±n/a nM
Citation
 Kasibhatla, SRBookser, BCXiao, WErion, MD AMP deaminase inhibitors. 5. Design, synthesis, and SAR of a highly potent inhibitor series. J Med Chem 44:613-8 (2001)  
Target
Name:
AMP deaminase 3
Synonyms:
AMP deaminase 3 AMPD3 | AMPD3_HUMAN
Type:
Protein
Mol. Mass.:
88818.80
Organism:
Homo sapiens (Human)
Description:
Residue:
767
  
Inhibitor
Name:
BDBM50096178
Synonyms:
4-[2-(8-Hydroxy-7,8-dihydro-6H-imidazo[4,5-d][1,3]diazepin-3-yl)-ethyl]-5,6,7,8-tetrahydro-naphthalene-2-carboxylic acid ethyl ester | CHEMBL156990
Type:
Small organic molecule
Emp. Form.:
C21H26N4O3
Mol. Mass.:
382.4561
SMILES:
CCOC(=O)c1cc(CCn2cnc3C(O)CNC=Nc23)c2CCCCc2c1
: