Target
Prothrombin
Ligand
BDBM13862
Substrate
Meas. Tech.
ChEBML_208507
Ki
620±n/a nM
Citation
 Heinelt, UHerok, SMatter, HWildgoose, P Solid-phase optimisation of achiral amidinobenzyl indoles as potent and selective factor Xa inhibitors. Bioorg Med Chem Lett 11:227-30 (2001)  
Target
Name:
Prothrombin
Synonyms:
Activation peptide fragment 1 Coagulation factor II Prothrombin precursor Thrombin heavy chain | Thrombin light chain
Type:
Protein
Mol. Mass.:
70029.57
Organism:
Homo sapiens (Human)
Description:
P00734
Residue:
622
  
Inhibitor
Name:
BDBM13862
Synonyms:
1-[(3-carbamimidoylphenyl)methyl]-N-[(3,5-dimethylphenyl)methyl]-4-hydroxy-1H-indole-2-carboxamide CHEMBL307196
Type:
Small organic molecule
Emp. Form.:
C26H26N4O2
Mol. Mass.:
426.5102
SMILES:
Cc1cc(C)cc(CNC(=O)c2cc3c(O)cccc3n2Cc2cccc(c2)C(N)=N)c1
: