Target
Serine protease 1
Ligand
BDBM50096621
Substrate
Meas. Tech.
ChEBML_212852
Ki
1400±n/a nM
Citation
 Bachand, BTarazi, MSt-Denis, YEdmunds, JJWinocour, PDLeblond, LSiddiqui, MA Potent and selective bicyclic lactam inhibitors of thrombin. Part 4: transition state inhibitors. Bioorg Med Chem Lett 11:287-90 (2001)  
Target
Name:
Serine protease 1
Synonyms:
Alpha-trypsin chain 1 Beta-trypsin PRSS1 TRP1 TRY1_HUMAN Thrombin & trypsin Trypsin I | Trypsin-1
Type:
Enzyme
Mol. Mass.:
26557.80
Organism:
Homo sapiens (Human)
Description:
P07477
Residue:
247
  
Inhibitor
Name:
BDBM50096621
Synonyms:
(6S,8aS)-4-Oxo-2-phenylmethanesulfonyl-octahydro-pyrrolo[1,2-a]pyrazine-6-carboxylic acid [1-(4-amino-cyclohexyl)-2-benzothiazol-2-yl-2-oxo-ethyl]-amide | CHEMBL3084829
Type:
Small organic molecule
Emp. Form.:
C30H35N5O5S2
Mol. Mass.:
609.759
SMILES:
[H][C@@]12CC[C@H](N1C(=O)CN(C2)S(=O)(=O)Cc1ccccc1)C(=O)NC([C@H]1CC[C@H](N)CC1)C(=O)c1nc2ccccc2s1
: