Target
Mu-type opioid receptor
Ligand
BDBM50096719
Substrate
Meas. Tech.
ChEBML_148999
Ki
0.030000±n/a nM
Citation
 Sasaki, YHirabuki, MAmbo, AOuchi, HYamamoto, Y Enkephalin analogues with 2',6'-dimethylphenylalanine replacing phenylalanine in position 4. Bioorg Med Chem Lett 11:327-9 (2001)  
Target
Name:
Mu-type opioid receptor
Synonyms:
MOR-1 Mu-type opioid receptor (MOR) OPRM_RAT Opioid receptor B Ror-b
Type:
G Protein-Coupled Receptor (GPCR)
Mol. Mass.:
44503.11
Organism:
Rattus norvegicus (rat)
Description:
Competition binding assays were carried out using membrane preparations from transfected HN9.10 cells that constitutively expressed the mu opioid receptor.
Residue:
398
  
Inhibitor
Name:
BDBM50096719
Synonyms:
(S)-2-[(R)-2-(2-{2-[(S)-2-Amino-3-(4-hydroxy-2,6-dimethyl-phenyl)-propionylamino]-acetylamino}-acetylamino)-3-(2,6-dimethyl-phenyl)-propionylamino]-4-methyl-pentanoic acid | CHEMBL109327
Type:
Small organic molecule
Emp. Form.:
C32H45N5O7
Mol. Mass.:
611.729
SMILES:
CC(C)C[C@H](NC(=O)[C@@H](Cc1c(C)cccc1C)NC(=O)CNC(=O)CNC(=O)[C@@H](N)Cc1c(C)cc(O)cc1C)C(O)=O
: