Target
Sodium-dependent serotonin transporter
Ligand
BDBM50096914
Substrate
Meas. Tech.
ChEBML_201991
Ki
2.8±n/a nM
Citation
 Davies, HMRen, PKong, NSexton, TChilders, SR Synthesis and monoamine transporter affinity of 3beta-(4-(2-pyrrolyl)phenyl)-8-azabicycl. Bioorg Med Chem Lett 11:487-9 (2001)  
Target
Name:
Sodium-dependent serotonin transporter
Synonyms:
5-HT Transporter 5HT transporter Anandamid membrane transporter, AMT Monoamine transporters; Norepinephrine & serotonin Slc6a4 Sodium-dependent serotonin transporter (SERT) | imipramine receptor
Type:
Multi-pass membrane protein
Mol. Mass.:
70168.43
Organism:
Rattus norvegicus (rat)
Description:
P31652
Residue:
630
  
Inhibitor
Name:
BDBM50096914
Synonyms:
8-Methyl-3-(1-methyl-1H-indol-5-yl)-8-aza-bicyclo[3.2.1]octane-2-carboxylic acid ethyl ester | CHEMBL357890
Type:
Small organic molecule
Emp. Form.:
C20H26N2O2
Mol. Mass.:
326.4326
SMILES:
CCOC(=O)C1C2CCC(CC1c1ccc3n(C)ccc3c1)N2C
: