Target
Proline--tRNA ligase, cytoplasmic
Ligand
BDBM50097095
Substrate
Meas. Tech.
ChEBML_223470
IC50
20±n/a nM
Citation
 Yu, XYHill, JMYu, GYang, YKluge, AFKeith, DFinn, JGallant, PSilverman, JLim, A A series of quinoline analogues as potent inhibitors of C. albicans prolyl tRNA synthetase. Bioorg Med Chem Lett 11:541-4 (2001)  
Target
Name:
Proline--tRNA ligase, cytoplasmic
Synonyms:
PRS Proline--tRNA ligase Prolyl-tRNA synthetase, cytoplasmic | SYPC_CANAX
Type:
PROTEIN
Mol. Mass.:
66202.25
Organism:
Candida albicans
Description:
ChEMBL_223470
Residue:
575
  
Inhibitor
Name:
BDBM50097095
Synonyms:
2-(4-Bromo-phenyl)-6-chloro-8-methyl-quinoline-4-carboxylic acid 3,4-dichloro-benzyl ester | CHEMBL345331
Type:
Small organic molecule
Emp. Form.:
C24H15BrCl3NO2
Mol. Mass.:
535.644
SMILES:
Cc1cc(Cl)cc2c(cc(nc12)-c1ccc(Br)cc1)C(=O)OCc1ccc(Cl)c(Cl)c1
: