Target
Bifunctional glutamate/proline--tRNA ligase
Ligand
BDBM50097094
Substrate
Meas. Tech.
ChEBML_223472
IC50
>100000±n/a nM
Citation
 Yu, XYHill, JMYu, GYang, YKluge, AFKeith, DFinn, JGallant, PSilverman, JLim, A A series of quinoline analogues as potent inhibitors of C. albicans prolyl tRNA synthetase. Bioorg Med Chem Lett 11:541-4 (2001)  
Target
Name:
Bifunctional glutamate/proline--tRNA ligase
Synonyms:
Aminoacyl-tRNA synthetase EPRS GLNS Glutamyl-tRNA synthetase Proliferation-inducing gene 32 protein QARS SYEP_HUMAN
Type:
PROTEIN
Mol. Mass.:
170602.50
Organism:
Homo sapiens (Human)
Description:
ChEMBL_223474
Residue:
1512
  
Inhibitor
Name:
BDBM50097094
Synonyms:
2-(4-Bromo-phenyl)-quinoline-4-carboxylic acid | CHEMBL440534
Type:
Small organic molecule
Emp. Form.:
C16H10BrNO2
Mol. Mass.:
328.16
SMILES:
OC(=O)c1cc(nc2ccccc12)-c1ccc(Br)cc1
: