Target
Sodium-dependent noradrenaline transporter
Ligand
BDBM50010859
Substrate
Meas. Tech.
ChEBML_142939
Ki
16±n/a nM
Citation
 Runyon, SPSavage, JETaroua, MRoth, BLGlennon, RAWestkaemper, RB Influence of chain length and N-alkylation on the selective serotonin receptor ligand 9-(aminomethyl)-9,10-dihydroanthracene. Bioorg Med Chem Lett 11:655-8 (2001)  
Target
Name:
Sodium-dependent noradrenaline transporter
Synonyms:
Norepinephrine transporter Slc6a2 | Sodium-dependent noradrenaline transporter
Type:
Enzyme Catalytic Domain
Mol. Mass.:
69260.85
Organism:
MOUSE
Description:
Norepinephrine transporter 0 MOUSE::O55192
Residue:
617
  
Inhibitor
Name:
BDBM50010859
Synonyms:
CHEMBL11 IMIPRAMINE PAMOATE | Imipramin
Type:
Small organic molecule
Emp. Form.:
C19H24N2
Mol. Mass.:
280.4073
SMILES:
CN(C)CCCN1c2ccccc2CCc2ccccc12
: