Target
Retinoic acid receptor alpha
Ligand
BDBM50097822
Substrate
Meas. Tech.
ChEBML_195195
Kd
350±n/a nM
Citation
 Beard, RLKlein, ESStandeven, AMEscobar, MChandraratna, RA Phenylcyclohexene and phenylcyclohexadiene substituted compounds having retinoid antagonist activity. Bioorg Med Chem Lett 11:765-8 (2001)  
Target
Name:
Retinoic acid receptor alpha
Synonyms:
NR1B1 RAR-alpha RARA_HUMAN Retinoic acid receptor alpha/Retinoid X receptor alpha Retinoid receptor
Type:
PROTEIN
Mol. Mass.:
50778.87
Organism:
Homo sapiens (Human)
Description:
ChEMBL_1466191
Residue:
462
  
Inhibitor
Name:
BDBM50097822
Synonyms:
4-{(E)-4-[2-(4-tert-Butyl-phenyl)-6,6-dimethyl-cyclohex-1-enyl]-but-3-en-1-ynyl}-benzoic acid | CHEMBL424190
Type:
Small organic molecule
Emp. Form.:
C29H32O2
Mol. Mass.:
412.5632
SMILES:
CC(C)(C)c1ccc(cc1)C1=C(\C=C\C#Cc2ccc(cc2)C(O)=O)C(C)(C)CCC1
: