Target
Calcitonin gene-related peptide type 1 receptor/Receptor activity-modifying protein 1
Ligand
BDBM361594
Substrate
Meas. Tech.
ChEMBL_1984211 (CHEMBL4617617)
Ki
0.067000±n/a nM
Citation
 Dubowchik, GMConway, CMXin, AW Blocking the CGRP Pathway for Acute and Preventive Treatment of Migraine: The Evolution of Success. J Med Chem 63:6600-6623 (2020)  
Target
Name:
Calcitonin gene-related peptide type 1 receptor/Receptor activity-modifying protein 1
Synonyms:
Calcitonin-gene-related peptide receptor, CALCRL/RAMP1
Type:
Mol. Mass.:
Description:
ASSAY_ID of EBI is 327200
Components:
This complex has 2 components.
Component 1
Name:
Calcitonin gene-related peptide type 1 receptor
Synonyms:
Adrenomedullin receptor AM1; CALCRL/RAMP2 CALRL_HUMAN CGRP type 1 receptor mRNA Calcitonin gene-related peptide (CGRP) receptor Calcitonin receptor-like receptor Human CL receptor
Type:
Enzyme Catalytic Domain
Mol. Mass.:
52980.45
Organism:
Homo sapiens (Human)
Description:
Q16602
Residue:
461
  
Component 2
Name:
Receptor activity-modifying protein 1
Synonyms:
Calcitonin-gene-related peptide receptor, CALCRL/RAMP1 RAMP1_HUMAN
Type:
PROTEIN
Mol. Mass.:
16992.80
Organism:
Homo sapiens (Human)
Description:
EBI_100673
Residue:
148
  
Inhibitor
Name:
BDBM361594
Synonyms:
US10272077, Example 1 | US9833448, Example 1
Type:
Small organic molecule
Emp. Form.:
C29H26F3N5O3
Mol. Mass.:
549.5436
SMILES:
C[C@@H]1[C@@H](C[C@H](NC(=O)c2cnc3C[C@]4(Cc3c2)C(=O)Nc2ncccc42)C(=O)N1CC(F)(F)F)c1ccccc1
: