Target
Substance-K receptor
Ligand
BDBM50097911
Substrate
Meas. Tech.
ChEMBL_209014 (CHEMBL815378)
IC50
2.5±n/a nM
Citation
 Ali, MABhogal, NFishwick, CWFindlay, JB Spatial requirements of the antagonist binding site of the NK2 receptor. Bioorg Med Chem Lett 11:819-22 (2001)  
Target
Name:
Substance-K receptor
Synonyms:
NK-2 receptor NK2R NKNAR Neurokinin A receptor Neurokinin-2 (NK-2) SKR TACR2 Tachykinin receptor 2 (NK2) | hnk-3
Type:
Protein
Mol. Mass.:
44455.78
Organism:
Homo sapiens (Human)
Description:
P21452
Residue:
398
  
Inhibitor
Name:
BDBM50097911
Synonyms:
3-[2-(4-Benzenesulfinylmethyl-4-methoxy-piperidin-1-yl)-ethyl]-5-fluoro-1H-indole CHEMBL166161 | GR-159897
Type:
Small organic molecule
Emp. Form.:
C23H27FN2O2S
Mol. Mass.:
414.536
SMILES:
COC1(CS(=O)c2ccccc2)CCN(CCc2c[nH]c3ccc(F)cc23)CC1
: