Target
Proto-oncogene tyrosine-protein kinase Src
Ligand
BDBM50097945
Substrate
Meas. Tech.
ChEMBL_221659 (CHEMBL823236)
IC50
600±n/a nM
Citation
 Widler, LGreen, JMissbach, MSusa, MAltmann, E 7-Alkyl- and 7-cycloalkyl-5-aryl-pyrrolo[2,3-d]pyrimidines--potent inhibitors of the tyrosine kinase c-Src. Bioorg Med Chem Lett 11:849-52 (2001)  
Target
Name:
Proto-oncogene tyrosine-protein kinase Src
Synonyms:
Proto-oncogene c-Src SRC_CHICK c-Src p60c-src | pp60c-src
Type:
Tyr protein kinase
Mol. Mass.:
60015.36
Organism:
Gallus gallus (Chicken)
Description:
P00523
Residue:
533
  
Inhibitor
Name:
BDBM50097945
Synonyms:
7-Cyclobutyl-5-(3-methoxy-phenyl)-7H-pyrrolo[2,3-d]pyrimidin-4-ylamine CHEMBL355191
Type:
Small organic molecule
Emp. Form.:
C17H18N4O
Mol. Mass.:
294.351
SMILES:
COc1cccc(c1)-c1cn(C2CCC2)c2ncnc(N)c12
: