Target
Proteinase-activated receptor 1
Ligand
BDBM50098218
Substrate
Meas. Tech.
ChEMBL_151865 (CHEMBL759579)
Kd
2.2±n/a nM
Citation
 Zhang, HCDerian, CKAndrade-Gordon, PHoekstra, WJMcComsey, DFWhite, KBPoulter, BLAddo, MFCheung, WMDamiano, BPOksenberg, DReynolds, EEPandey, AScarborough, RMMaryanoff, BE Discovery and optimization of a novel series of thrombin receptor (par-1) antagonists: potent, selective peptide mimetics based on indole and indazole templates. J Med Chem 44:1021-4 (2001)  
Target
Name:
Proteinase-activated receptor 1
Synonyms:
CF2R F2R PAR1 Proteinase activated receptor 1 TR Thrombin receptor/ Proteinase-activated receptor 1(Par-1)
Type:
Protein
Mol. Mass.:
47450.07
Organism:
Homo sapiens (Human)
Description:
P25116
Residue:
425
  
Inhibitor
Name:
BDBM50098218
Synonyms:
(S)-2-[(S)-2-{3-[1-(4-Fluoro-benzyl)-3-pyrrolidin-1-ylmethyl-1H-indol-6-yl]-ureido}-3-(4-methoxy-phenyl)-propionylamino]-5-guanidino-pentanoic acid benzylamide CHEMBL269345
Type:
Small organic molecule
Emp. Form.:
C44H52FN9O4
Mol. Mass.:
789.94
SMILES:
COc1ccc(C[C@H](NC(=O)Nc2ccc3c(CN4CCCC4)cn(Cc4ccc(F)cc4)c3c2)C(=O)N[C@@H](CCCNC(N)=N)C(=O)NCc2ccccc2)cc1
: