Target
Intercellular adhesion molecule 1
Ligand
BDBM50098476
Substrate
Meas. Tech.
ChEMBL_89064 (CHEMBL697203)
IC50
32±n/a nM
Citation
 Stewart, AOBhatia, PAMcCarty, CMPatel, MVStaeger, MAArendsen, DLGunawardana, IWMelcher, LMZhu, GDBoyd, SAFry, DGCool, BLKifle, LLartey, KMarsh, KCKempf-Grote, AJKilgannon, PWisdom, WMeyer, JGallatin, WMOkasinski, GF Discovery of inhibitors of cell adhesion molecule expression in human endothelial cells. 1. Selective inhibition of ICAM-1 and E-selectin expression. J Med Chem 44:988-1002 (2001)  
Target
Name:
Intercellular adhesion molecule 1
Synonyms:
CD_antigen=CD54 ICAM1 Intercellular adhesion molecule (ICAM-1), Integrin alpha-L/beta-2 Intercellular adhesion molecule-1 | Major group rhinovirus receptor
Type:
PROTEIN
Mol. Mass.:
57831.10
Organism:
Homo sapiens (Human)
Description:
ChEMBL_826675
Residue:
532
  
Inhibitor
Name:
BDBM50098476
Synonyms:
4-p-Tolylsulfanyl-thieno[2,3-c]pyridine-2-carboxylic acid hydrazide | CHEMBL269598
Type:
Small organic molecule
Emp. Form.:
C15H13N3OS2
Mol. Mass.:
315.413
SMILES:
Cc1ccc(Sc2cncc3sc(cc23)C(=O)NN)cc1
: