Target
E-selectin
Ligand
BDBM50098476
Substrate
Meas. Tech.
ChEMBL_199704 (CHEMBL803587)
IC50
32±n/a nM
Citation
 Stewart, AOBhatia, PAMcCarty, CMPatel, MVStaeger, MAArendsen, DLGunawardana, IWMelcher, LMZhu, GDBoyd, SAFry, DGCool, BLKifle, LLartey, KMarsh, KCKempf-Grote, AJKilgannon, PWisdom, WMeyer, JGallatin, WMOkasinski, GF Discovery of inhibitors of cell adhesion molecule expression in human endothelial cells. 1. Selective inhibition of ICAM-1 and E-selectin expression. J Med Chem 44:988-1002 (2001)  
Target
Name:
E-selectin
Synonyms:
ELAM1 SELE Selectin E
Type:
PROTEIN
Mol. Mass.:
66642.96
Organism:
Homo sapiens (Human)
Description:
ChEMBL_1438995
Residue:
610
  
Inhibitor
Name:
BDBM50098476
Synonyms:
4-p-Tolylsulfanyl-thieno[2,3-c]pyridine-2-carboxylic acid hydrazide | CHEMBL269598
Type:
Small organic molecule
Emp. Form.:
C15H13N3OS2
Mol. Mass.:
315.413
SMILES:
Cc1ccc(Sc2cncc3sc(cc23)C(=O)NN)cc1
: