Target
5-hydroxytryptamine receptor 7
Ligand
BDBM50098551
Substrate
Meas. Tech.
ChEMBL_3755 (CHEMBL620755)
Ki
1.26±n/a nM
Citation
 Linnanen, TBrisander, MUnelius, LRosqvist, SNordvall, GHacksell, UJohansson, AM Atropisomeric derivatives of 2',6'-disubstituted (R)-11-phenylaporphine: selective serotonin 5-HT(7) receptor antagonists. J Med Chem 44:1337-40 (2001)  
Target
Name:
5-hydroxytryptamine receptor 7
Synonyms:
5-HT-7 5-HT7 5-HT7S 5-hydroxytryptamine receptor 7 5HT7R_RAT GPRFO Serotonin (5-HT) receptor | Serotonin Receptor 7
Type:
G Protein-Coupled Receptor (GPCR)
Mol. Mass.:
49852.62
Organism:
Rattus norvegicus (rat)
Description:
Rat cloned 5-HT7R.
Residue:
448
  
Inhibitor
Name:
BDBM50098551
Synonyms:
(R)-3-(2-(2-(4-methylpiperidin-1-yl)ethyl)pyrrolidin-1-ylsulfonyl)phenol 3-{(R)-2-[2-(4-Methyl-piperidin-1-yl)-ethyl]-pyrrolidine-1-sulfonyl}-phenol 3-{2-[2-(4-Methyl-piperidin-1-yl)-ethyl]-pyrrolidine-1-sulfonyl}-phenol CHEMBL282199 | SB-269970
Type:
Small organic molecule
Emp. Form.:
C18H28N2O3S
Mol. Mass.:
352.492
SMILES:
CC1CCN(CC[C@H]2CCCN2S(=O)(=O)c2cccc(O)c2)CC1
: